Execute TYPO3 core 9.5 nightly tests. Auto generated! See Build/bamboo of core git repository.

Build: #44 failed Rebuilt by Bamboo CLI Admin

Stages & jobs

  1. Preparation

  2. Integrity

  3. Stage 1, Jobs 1 - 50

  4. Stage 2, Jobs 51 - 100

  5. Stage 3, Jobs 101 - 150

  6. Stage 4, Jobs 151 - 200

  7. Stage 5, Jobs 201 - 250

  8. Stage 6, Jobs 251 - 300

  9. Stage 7, Jobs 301 - 350

  10. Stage 8, Jobs 351 - 400

  11. Stage 9, Jobs 401 - 450

  12. Stage 10, Jobs 451 - 500

  13. Stage 11, Jobs 501 - 550

  14. Stage 12, Jobs 551 - 600

  15. Stage 13, Jobs 601 - 639

Build result summary

Details

Completed
Duration
448 minutes
Labels
change-patchset-
Revision
47360d8b353ef3a97c2e35e64e8f5912929a7600 47360d8b353ef3a97c2e35e64e8f5912929a7600
Total tests
400685
Failing since
#42 (Rebuilt by Susanne Moog)
Fixed in
#46 (Rebuilt by Anja Leichsenring)
Number of retries
1

Tests

Responsible

This build has been failing since #42
No one has taken responsibility

Comments on Func mssql pdo PHP74 14

  1. Anonymous user

    Detected hung build state. Attempting to generate stack trace and terminate spawned sub-processes.

Code commits

Author Commit Message Commit date
Susanne Moog <look@susi.dev> Susanne Moog <look@susi.dev> 47360d8b353ef3a97c2e35e64e8f5912929a7600 47360d8b353ef3a97c2e35e64e8f5912929a7600 [BUGFIX] Remove mention of deprecation log in presets
The debug/live presets toggled the deprecation log in earlier versions.
Since rewriting the deprecation log to the logging framework, the
presets do not take deprecations into account anymore. Due to the
configuration merge between Default and LocalConfiguration it is
currently not possible to disable the deprecation log by overwriting
it in LocalConfiguration - setting will only take effect when set in
AdditionalConfiguration. Therefor we are removing the mention of
deprecation logs in the presets to avoid confusion.

Resolves: #89769
Releases: master, 9.5
Change-Id: I0bc1db480a31692350ea20454cfc5b143edcc70a
Reviewed-on: https://review.typo3.org/c/Packages/TYPO3.CMS/+/63895
Tested-by: Georg Ringer <georg.ringer@gmail.com>
Tested-by: TYPO3com <noreply@typo3.com>
Tested-by: Benni Mack <benni@typo3.org>
Reviewed-by: Georg Ringer <georg.ringer@gmail.com>
Reviewed-by: Benni Mack <benni@typo3.org>
Josef Glatz <josefglatz@gmail.com> Josef Glatz <josefglatz@gmail.com> 74d1141d087c6bc4a9abb002293d6147350519f3 74d1141d087c6bc4a9abb002293d6147350519f3 [BUGFIX] Sort upgrade documentation by filename
Restore sorting of documentation files based on their filename
like it was available up to TYPO3 version 8.7.

Resolves: #87390
Releases: master, 9.5
Change-Id: I2ab75d6b750b3a3003f00ed174c0d3dfb865bec9
Reviewed-on: https://review.typo3.org/c/Packages/TYPO3.CMS/+/63894
Tested-by: TYPO3com <noreply@typo3.com>
Tested-by: Susanne Moog <look@susi.dev>
Reviewed-by: Susanne Moog <look@susi.dev>
Daniel Siepmann <daniel.siepmann@typo3.org> Daniel Siepmann <daniel.siepmann@typo3.org> 4072f229248bc5d1307d22139400667f145cb9ec 4072f229248bc5d1307d22139400667f145cb9ec [DOCS] Correct information regarding ipAnonymization setting
Resolves: #85653
Releases: master, 9.5
Change-Id: Idda07be57a1774362b2aea0ea6e019a0c4f7a6e2
Reviewed-on: https://review.typo3.org/c/Packages/TYPO3.CMS/+/63893
Tested-by: TYPO3com <noreply@typo3.com>
Tested-by: Benni Mack <benni@typo3.org>
Reviewed-by: Benni Mack <benni@typo3.org>
Benjamin Kott <benjamin.kott@outlook.com> Benjamin Kott <benjamin.kott@outlook.com> 933fcd88a9301d2518986c05b4e7897d6b1bbe3c 933fcd88a9301d2518986c05b4e7897d6b1bbe3c [BUGFIX] Prevent overriding ckeditor config from plugins
Configuration from external plugins is now only set if the plugin actually
provided some. By default, the plugin name is used for any configuration
provided by an external plugin. Since the name of the internal configuration
setting can be chosen by the author of a plugin we now provide a new option
to adjust the name that should be used.

Resolves: #88302
Releases: master, 9.5, 8.7
Change-Id: I5c1f921f4897cf15e11199015454d0927915a30e
Reviewed-on: https://review.typo3.org/c/Packages/TYPO3.CMS/+/63891
Tested-by: TYPO3com <noreply@typo3.com>
Tested-by: Susanne Moog <look@susi.dev>
Reviewed-by: Susanne Moog <look@susi.dev>
Nicole Cordes <typo3@cordes.co> Nicole Cordes <typo3@cordes.co> f1685c23742644c53e55db84ab61d666deb0ffc1 f1685c23742644c53e55db84ab61d666deb0ffc1 [BUGFIX] Catch error in database Upgrade Wizard
If an extension provides wrong SQL in ext_tables.sql, the upgrade
wizard is skipped completely. This patch catches the current
exception and outputs the error that needs to be resolved manually.

Resolves: #87187
Releases: master, 9.5
Change-Id: I903ce7fdc9373eee66da7bed86698c42a2731dc7
Reviewed-on: https://review.typo3.org/c/Packages/TYPO3.CMS/+/63912
Tested-by: TYPO3com <noreply@typo3.com>
Tested-by: Susanne Moog <look@susi.dev>
Reviewed-by: Susanne Moog <look@susi.dev>

Configuration changes

Some of the jobs or stages referenced by this result no longer exist.

Tests

New test failures 28
Status Test View job Duration
Collapse Failed ActionTest modifyParentWithHotelChild History
Func mssql pdo PHP74 12 < 1 sec
TYPO3\CMS\Workspaces\Tests\Functional\DataHandling\IRRE\CSV\Modify\ActionTest::modifyParentWithHotelChild
Doctrine\DBAL\Driver\PDOException: SQLSTATE[42000]: [Microsoft][ODBC Driver 17 for SQL Server][SQL Server]Cannot open database "func_ftd3d8a47" requested by the login. The login failed.

/srv/bamboo/xml-data/build-dir/CORE-GTN95-FMSP0PHP7412/vendor/doctrine/dbal/lib/Doctrine/DBAL/Driver/PDOConnection.php:31
/srv/bamboo/xml-data/build-dir/CORE-GTN95-FMSP0PHP7412/vendor/doctrine/dbal/lib/Doctrine/DBAL/Driver/PDOSqlsrv/Connection.php:21
/srv/bamboo/xml-data/build-dir/CORE-GTN95-FMSP0PHP7412/typo3/sysext/core/Classes/Database/Driver/PDOSqlsrv/Connection.php:32
/srv/bamboo/xml-data/build-dir/CORE-GTN95-FMSP0PHP7412/typo3/sysext/core/Classes/Database/Driver/PDOSqlsrv/Driver.php:33
/srv/bamboo/xml-data/build-dir/CORE-GTN95-FMSP0PHP7412/vendor/doctrine/dbal/lib/Doctrine/DBAL/Connection.php:362
(11 more lines...)
Collapse Failed ActionTest copyPage History
Func mssql pdo PHP74 12 < 1 sec
TYPO3\CMS\Workspaces\Tests\Functional\DataHandling\IRRE\CSV\Modify\ActionTest::copyPage
Doctrine\DBAL\Driver\PDOException: SQLSTATE[42000]: [Microsoft][ODBC Driver 17 for SQL Server][SQL Server]Cannot open database "func_ftd3d8a47" requested by the login. The login failed.

/srv/bamboo/xml-data/build-dir/CORE-GTN95-FMSP0PHP7412/vendor/doctrine/dbal/lib/Doctrine/DBAL/Driver/PDOConnection.php:31
/srv/bamboo/xml-data/build-dir/CORE-GTN95-FMSP0PHP7412/vendor/doctrine/dbal/lib/Doctrine/DBAL/Driver/PDOSqlsrv/Connection.php:21
/srv/bamboo/xml-data/build-dir/CORE-GTN95-FMSP0PHP7412/typo3/sysext/core/Classes/Database/Driver/PDOSqlsrv/Connection.php:32
/srv/bamboo/xml-data/build-dir/CORE-GTN95-FMSP0PHP7412/typo3/sysext/core/Classes/Database/Driver/PDOSqlsrv/Driver.php:33
/srv/bamboo/xml-data/build-dir/CORE-GTN95-FMSP0PHP7412/vendor/doctrine/dbal/lib/Doctrine/DBAL/Connection.php:362
(11 more lines...)
Collapse Failed ActionTest deleteParentContent History
Func mssql pdo PHP74 12 < 1 sec
TYPO3\CMS\Workspaces\Tests\Functional\DataHandling\IRRE\CSV\Modify\ActionTest::deleteParentContent
Doctrine\DBAL\Driver\PDOException: SQLSTATE[42000]: [Microsoft][ODBC Driver 17 for SQL Server][SQL Server]Cannot open database "func_ftd3d8a47" requested by the login. The login failed.

/srv/bamboo/xml-data/build-dir/CORE-GTN95-FMSP0PHP7412/vendor/doctrine/dbal/lib/Doctrine/DBAL/Driver/PDOConnection.php:31
/srv/bamboo/xml-data/build-dir/CORE-GTN95-FMSP0PHP7412/vendor/doctrine/dbal/lib/Doctrine/DBAL/Driver/PDOSqlsrv/Connection.php:21
/srv/bamboo/xml-data/build-dir/CORE-GTN95-FMSP0PHP7412/typo3/sysext/core/Classes/Database/Driver/PDOSqlsrv/Connection.php:32
/srv/bamboo/xml-data/build-dir/CORE-GTN95-FMSP0PHP7412/typo3/sysext/core/Classes/Database/Driver/PDOSqlsrv/Driver.php:33
/srv/bamboo/xml-data/build-dir/CORE-GTN95-FMSP0PHP7412/vendor/doctrine/dbal/lib/Doctrine/DBAL/Connection.php:362
(11 more lines...)
Collapse Failed ActionTest createParentContent History
Func mssql pdo PHP74 12 2 mins
TYPO3\CMS\Workspaces\Tests\Functional\DataHandling\IRRE\CSV\Modify\ActionTest::createParentContent
Doctrine\DBAL\Driver\PDOException: SQLSTATE[HYT00]: [Microsoft][ODBC Driver 17 for SQL Server]Login timeout expired

/srv/bamboo/xml-data/build-dir/CORE-GTN95-FMSP0PHP7412/vendor/doctrine/dbal/lib/Doctrine/DBAL/Driver/PDOConnection.php:31
/srv/bamboo/xml-data/build-dir/CORE-GTN95-FMSP0PHP7412/vendor/doctrine/dbal/lib/Doctrine/DBAL/Driver/PDOSqlsrv/Connection.php:21
/srv/bamboo/xml-data/build-dir/CORE-GTN95-FMSP0PHP7412/vendor/doctrine/dbal/lib/Doctrine/DBAL/Driver/PDOSqlsrv/Driver.php:30
/srv/bamboo/xml-data/build-dir/CORE-GTN95-FMSP0PHP7412/vendor/doctrine/dbal/lib/Doctrine/DBAL/Connection.php:362
/srv/bamboo/xml-data/build-dir/CORE-GTN95-FMSP0PHP7412/typo3/sysext/core/Classes/Database/Connection.php:93
(11 more lines...)
Collapse Failed ActionTest modifyOnlyHotelChild History
Func mssql pdo PHP74 12 < 1 sec
TYPO3\CMS\Workspaces\Tests\Functional\DataHandling\IRRE\CSV\Modify\ActionTest::modifyOnlyHotelChild
Doctrine\DBAL\Driver\PDOException: SQLSTATE[42000]: [Microsoft][ODBC Driver 17 for SQL Server][SQL Server]Cannot open database "func_ftd3d8a47" requested by the login. The login failed.

/srv/bamboo/xml-data/build-dir/CORE-GTN95-FMSP0PHP7412/vendor/doctrine/dbal/lib/Doctrine/DBAL/Driver/PDOConnection.php:31
/srv/bamboo/xml-data/build-dir/CORE-GTN95-FMSP0PHP7412/vendor/doctrine/dbal/lib/Doctrine/DBAL/Driver/PDOSqlsrv/Connection.php:21
/srv/bamboo/xml-data/build-dir/CORE-GTN95-FMSP0PHP7412/typo3/sysext/core/Classes/Database/Driver/PDOSqlsrv/Connection.php:32
/srv/bamboo/xml-data/build-dir/CORE-GTN95-FMSP0PHP7412/typo3/sysext/core/Classes/Database/Driver/PDOSqlsrv/Driver.php:33
/srv/bamboo/xml-data/build-dir/CORE-GTN95-FMSP0PHP7412/vendor/doctrine/dbal/lib/Doctrine/DBAL/Connection.php:362
(11 more lines...)
Collapse Failed ActionTest modifyParentAndDeleteHotelChild History
Func mssql pdo PHP74 12 < 1 sec
TYPO3\CMS\Workspaces\Tests\Functional\DataHandling\IRRE\CSV\Modify\ActionTest::modifyParentAndDeleteHotelChild
Doctrine\DBAL\Driver\PDOException: SQLSTATE[42000]: [Microsoft][ODBC Driver 17 for SQL Server][SQL Server]Cannot open database "func_ftd3d8a47" requested by the login. The login failed.

/srv/bamboo/xml-data/build-dir/CORE-GTN95-FMSP0PHP7412/vendor/doctrine/dbal/lib/Doctrine/DBAL/Driver/PDOConnection.php:31
/srv/bamboo/xml-data/build-dir/CORE-GTN95-FMSP0PHP7412/vendor/doctrine/dbal/lib/Doctrine/DBAL/Driver/PDOSqlsrv/Connection.php:21
/srv/bamboo/xml-data/build-dir/CORE-GTN95-FMSP0PHP7412/typo3/sysext/core/Classes/Database/Driver/PDOSqlsrv/Connection.php:32
/srv/bamboo/xml-data/build-dir/CORE-GTN95-FMSP0PHP7412/typo3/sysext/core/Classes/Database/Driver/PDOSqlsrv/Driver.php:33
/srv/bamboo/xml-data/build-dir/CORE-GTN95-FMSP0PHP7412/vendor/doctrine/dbal/lib/Doctrine/DBAL/Connection.php:362
(11 more lines...)
Collapse Failed ActionTest modifyParentWithHotelChildAndDiscardAll History
Func mssql pdo PHP74 12 < 1 sec
TYPO3\CMS\Workspaces\Tests\Functional\DataHandling\IRRE\CSV\Modify\ActionTest::modifyParentWithHotelChildAndDiscardAll
Doctrine\DBAL\Driver\PDOException: SQLSTATE[42000]: [Microsoft][ODBC Driver 17 for SQL Server][SQL Server]Cannot open database "func_ftd3d8a47" requested by the login. The login failed.

/srv/bamboo/xml-data/build-dir/CORE-GTN95-FMSP0PHP7412/vendor/doctrine/dbal/lib/Doctrine/DBAL/Driver/PDOConnection.php:31
/srv/bamboo/xml-data/build-dir/CORE-GTN95-FMSP0PHP7412/vendor/doctrine/dbal/lib/Doctrine/DBAL/Driver/PDOSqlsrv/Connection.php:21
/srv/bamboo/xml-data/build-dir/CORE-GTN95-FMSP0PHP7412/typo3/sysext/core/Classes/Database/Driver/PDOSqlsrv/Connection.php:32
/srv/bamboo/xml-data/build-dir/CORE-GTN95-FMSP0PHP7412/typo3/sysext/core/Classes/Database/Driver/PDOSqlsrv/Driver.php:33
/srv/bamboo/xml-data/build-dir/CORE-GTN95-FMSP0PHP7412/vendor/doctrine/dbal/lib/Doctrine/DBAL/Connection.php:362
(11 more lines...)
Collapse Failed ActionTest deleteParentContentAndDiscardDeletedParent History
Func mssql pdo PHP74 12 < 1 sec
TYPO3\CMS\Workspaces\Tests\Functional\DataHandling\IRRE\CSV\Modify\ActionTest::deleteParentContentAndDiscardDeletedParent
Doctrine\DBAL\Driver\PDOException: SQLSTATE[42000]: [Microsoft][ODBC Driver 17 for SQL Server][SQL Server]Cannot open database "func_ftd3d8a47" requested by the login. The login failed.

/srv/bamboo/xml-data/build-dir/CORE-GTN95-FMSP0PHP7412/vendor/doctrine/dbal/lib/Doctrine/DBAL/Driver/PDOConnection.php:31
/srv/bamboo/xml-data/build-dir/CORE-GTN95-FMSP0PHP7412/vendor/doctrine/dbal/lib/Doctrine/DBAL/Driver/PDOSqlsrv/Connection.php:21
/srv/bamboo/xml-data/build-dir/CORE-GTN95-FMSP0PHP7412/typo3/sysext/core/Classes/Database/Driver/PDOSqlsrv/Connection.php:32
/srv/bamboo/xml-data/build-dir/CORE-GTN95-FMSP0PHP7412/typo3/sysext/core/Classes/Database/Driver/PDOSqlsrv/Driver.php:33
/srv/bamboo/xml-data/build-dir/CORE-GTN95-FMSP0PHP7412/vendor/doctrine/dbal/lib/Doctrine/DBAL/Connection.php:362
(11 more lines...)
Collapse Failed ActionTest modifyParentAndAddHotelChild History
Func mssql pdo PHP74 12 < 1 sec
TYPO3\CMS\Workspaces\Tests\Functional\DataHandling\IRRE\CSV\Modify\ActionTest::modifyParentAndAddHotelChild
Doctrine\DBAL\Driver\PDOException: SQLSTATE[42000]: [Microsoft][ODBC Driver 17 for SQL Server][SQL Server]Cannot open database "func_ftd3d8a47" requested by the login. The login failed.

/srv/bamboo/xml-data/build-dir/CORE-GTN95-FMSP0PHP7412/vendor/doctrine/dbal/lib/Doctrine/DBAL/Driver/PDOConnection.php:31
/srv/bamboo/xml-data/build-dir/CORE-GTN95-FMSP0PHP7412/vendor/doctrine/dbal/lib/Doctrine/DBAL/Driver/PDOSqlsrv/Connection.php:21
/srv/bamboo/xml-data/build-dir/CORE-GTN95-FMSP0PHP7412/typo3/sysext/core/Classes/Database/Driver/PDOSqlsrv/Connection.php:32
/srv/bamboo/xml-data/build-dir/CORE-GTN95-FMSP0PHP7412/typo3/sysext/core/Classes/Database/Driver/PDOSqlsrv/Driver.php:33
/srv/bamboo/xml-data/build-dir/CORE-GTN95-FMSP0PHP7412/vendor/doctrine/dbal/lib/Doctrine/DBAL/Connection.php:362
(11 more lines...)
Collapse Failed ActionTest moveParentContentToDifferentPage History
Func mssql pdo PHP74 12 < 1 sec
TYPO3\CMS\Workspaces\Tests\Functional\DataHandling\IRRE\CSV\Modify\ActionTest::moveParentContentToDifferentPage
Doctrine\DBAL\Driver\PDOException: SQLSTATE[42000]: [Microsoft][ODBC Driver 17 for SQL Server][SQL Server]Cannot open database "func_ftd3d8a47" requested by the login. The login failed.

/srv/bamboo/xml-data/build-dir/CORE-GTN95-FMSP0PHP7412/vendor/doctrine/dbal/lib/Doctrine/DBAL/Driver/PDOConnection.php:31
/srv/bamboo/xml-data/build-dir/CORE-GTN95-FMSP0PHP7412/vendor/doctrine/dbal/lib/Doctrine/DBAL/Driver/PDOSqlsrv/Connection.php:21
/srv/bamboo/xml-data/build-dir/CORE-GTN95-FMSP0PHP7412/typo3/sysext/core/Classes/Database/Driver/PDOSqlsrv/Connection.php:32
/srv/bamboo/xml-data/build-dir/CORE-GTN95-FMSP0PHP7412/typo3/sysext/core/Classes/Database/Driver/PDOSqlsrv/Driver.php:33
/srv/bamboo/xml-data/build-dir/CORE-GTN95-FMSP0PHP7412/vendor/doctrine/dbal/lib/Doctrine/DBAL/Connection.php:362
(11 more lines...)
Collapse Failed ActionTest modifyAndDiscardAndModifyParentWithHotelChild History
Func mssql pdo PHP74 12 < 1 sec
TYPO3\CMS\Workspaces\Tests\Functional\DataHandling\IRRE\CSV\Modify\ActionTest::modifyAndDiscardAndModifyParentWithHotelChild
Doctrine\DBAL\Driver\PDOException: SQLSTATE[42000]: [Microsoft][ODBC Driver 17 for SQL Server][SQL Server]Cannot open database "func_ftd3d8a47" requested by the login. The login failed.

/srv/bamboo/xml-data/build-dir/CORE-GTN95-FMSP0PHP7412/vendor/doctrine/dbal/lib/Doctrine/DBAL/Driver/PDOConnection.php:31
/srv/bamboo/xml-data/build-dir/CORE-GTN95-FMSP0PHP7412/vendor/doctrine/dbal/lib/Doctrine/DBAL/Driver/PDOSqlsrv/Connection.php:21
/srv/bamboo/xml-data/build-dir/CORE-GTN95-FMSP0PHP7412/typo3/sysext/core/Classes/Database/Driver/PDOSqlsrv/Connection.php:32
/srv/bamboo/xml-data/build-dir/CORE-GTN95-FMSP0PHP7412/typo3/sysext/core/Classes/Database/Driver/PDOSqlsrv/Driver.php:33
/srv/bamboo/xml-data/build-dir/CORE-GTN95-FMSP0PHP7412/vendor/doctrine/dbal/lib/Doctrine/DBAL/Connection.php:362
(11 more lines...)
Collapse Failed ActionTest deletePage History
Func mssql pdo PHP74 12 < 1 sec
TYPO3\CMS\Workspaces\Tests\Functional\DataHandling\IRRE\CSV\Modify\ActionTest::deletePage
Doctrine\DBAL\Driver\PDOException: SQLSTATE[42000]: [Microsoft][ODBC Driver 17 for SQL Server][SQL Server]Cannot open database "func_ftd3d8a47" requested by the login. The login failed.

/srv/bamboo/xml-data/build-dir/CORE-GTN95-FMSP0PHP7412/vendor/doctrine/dbal/lib/Doctrine/DBAL/Driver/PDOConnection.php:31
/srv/bamboo/xml-data/build-dir/CORE-GTN95-FMSP0PHP7412/vendor/doctrine/dbal/lib/Doctrine/DBAL/Driver/PDOSqlsrv/Connection.php:21
/srv/bamboo/xml-data/build-dir/CORE-GTN95-FMSP0PHP7412/typo3/sysext/core/Classes/Database/Driver/PDOSqlsrv/Connection.php:32
/srv/bamboo/xml-data/build-dir/CORE-GTN95-FMSP0PHP7412/typo3/sysext/core/Classes/Database/Driver/PDOSqlsrv/Driver.php:33
/srv/bamboo/xml-data/build-dir/CORE-GTN95-FMSP0PHP7412/vendor/doctrine/dbal/lib/Doctrine/DBAL/Connection.php:362
(11 more lines...)
Collapse Failed ActionTest localizeParentContentWithAllChildren History
Func mssql pdo PHP74 12 < 1 sec
TYPO3\CMS\Workspaces\Tests\Functional\DataHandling\IRRE\CSV\Modify\ActionTest::localizeParentContentWithAllChildren
Doctrine\DBAL\Driver\PDOException: SQLSTATE[42000]: [Microsoft][ODBC Driver 17 for SQL Server][SQL Server]Cannot open database "func_ftd3d8a47" requested by the login. The login failed.

/srv/bamboo/xml-data/build-dir/CORE-GTN95-FMSP0PHP7412/vendor/doctrine/dbal/lib/Doctrine/DBAL/Driver/PDOConnection.php:31
/srv/bamboo/xml-data/build-dir/CORE-GTN95-FMSP0PHP7412/vendor/doctrine/dbal/lib/Doctrine/DBAL/Driver/PDOSqlsrv/Connection.php:21
/srv/bamboo/xml-data/build-dir/CORE-GTN95-FMSP0PHP7412/typo3/sysext/core/Classes/Database/Driver/PDOSqlsrv/Connection.php:32
/srv/bamboo/xml-data/build-dir/CORE-GTN95-FMSP0PHP7412/typo3/sysext/core/Classes/Database/Driver/PDOSqlsrv/Driver.php:33
/srv/bamboo/xml-data/build-dir/CORE-GTN95-FMSP0PHP7412/vendor/doctrine/dbal/lib/Doctrine/DBAL/Connection.php:362
(11 more lines...)
Collapse Failed ActionTest createAndLocalizeParentContentWithHotelAndOfferChildren History
Func mssql pdo PHP74 12 < 1 sec
TYPO3\CMS\Workspaces\Tests\Functional\DataHandling\IRRE\CSV\Modify\ActionTest::createAndLocalizeParentContentWithHotelAndOfferChildren
Doctrine\DBAL\Driver\PDOException: SQLSTATE[42000]: [Microsoft][ODBC Driver 17 for SQL Server][SQL Server]Cannot open database "func_ftd3d8a47" requested by the login. The login failed.

/srv/bamboo/xml-data/build-dir/CORE-GTN95-FMSP0PHP7412/vendor/doctrine/dbal/lib/Doctrine/DBAL/Driver/PDOConnection.php:31
/srv/bamboo/xml-data/build-dir/CORE-GTN95-FMSP0PHP7412/vendor/doctrine/dbal/lib/Doctrine/DBAL/Driver/PDOSqlsrv/Connection.php:21
/srv/bamboo/xml-data/build-dir/CORE-GTN95-FMSP0PHP7412/typo3/sysext/core/Classes/Database/Driver/PDOSqlsrv/Connection.php:32
/srv/bamboo/xml-data/build-dir/CORE-GTN95-FMSP0PHP7412/typo3/sysext/core/Classes/Database/Driver/PDOSqlsrv/Driver.php:33
/srv/bamboo/xml-data/build-dir/CORE-GTN95-FMSP0PHP7412/vendor/doctrine/dbal/lib/Doctrine/DBAL/Connection.php:362
(11 more lines...)
Collapse Failed ActionTest modifyParentAndChangeHotelChildrenSorting History
Func mssql pdo PHP74 12 < 1 sec
TYPO3\CMS\Workspaces\Tests\Functional\DataHandling\IRRE\CSV\Modify\ActionTest::modifyParentAndChangeHotelChildrenSorting
Doctrine\DBAL\Driver\PDOException: SQLSTATE[42000]: [Microsoft][ODBC Driver 17 for SQL Server][SQL Server]Cannot open database "func_ftd3d8a47" requested by the login. The login failed.

/srv/bamboo/xml-data/build-dir/CORE-GTN95-FMSP0PHP7412/vendor/doctrine/dbal/lib/Doctrine/DBAL/Driver/PDOConnection.php:31
/srv/bamboo/xml-data/build-dir/CORE-GTN95-FMSP0PHP7412/vendor/doctrine/dbal/lib/Doctrine/DBAL/Driver/PDOSqlsrv/Connection.php:21
/srv/bamboo/xml-data/build-dir/CORE-GTN95-FMSP0PHP7412/typo3/sysext/core/Classes/Database/Driver/PDOSqlsrv/Connection.php:32
/srv/bamboo/xml-data/build-dir/CORE-GTN95-FMSP0PHP7412/typo3/sysext/core/Classes/Database/Driver/PDOSqlsrv/Driver.php:33
/srv/bamboo/xml-data/build-dir/CORE-GTN95-FMSP0PHP7412/vendor/doctrine/dbal/lib/Doctrine/DBAL/Connection.php:362
(11 more lines...)
Collapse Failed ActionTest createAndCopyParentContentWithHotelAndOfferChildren History
Func mssql pdo PHP74 12 < 1 sec
TYPO3\CMS\Workspaces\Tests\Functional\DataHandling\IRRE\CSV\Modify\ActionTest::createAndCopyParentContentWithHotelAndOfferChildren
Doctrine\DBAL\Driver\PDOException: SQLSTATE[42000]: [Microsoft][ODBC Driver 17 for SQL Server][SQL Server]Cannot open database "func_ftd3d8a47" requested by the login. The login failed.

/srv/bamboo/xml-data/build-dir/CORE-GTN95-FMSP0PHP7412/vendor/doctrine/dbal/lib/Doctrine/DBAL/Driver/PDOConnection.php:31
/srv/bamboo/xml-data/build-dir/CORE-GTN95-FMSP0PHP7412/vendor/doctrine/dbal/lib/Doctrine/DBAL/Driver/PDOSqlsrv/Connection.php:21
/srv/bamboo/xml-data/build-dir/CORE-GTN95-FMSP0PHP7412/typo3/sysext/core/Classes/Database/Driver/PDOSqlsrv/Connection.php:32
/srv/bamboo/xml-data/build-dir/CORE-GTN95-FMSP0PHP7412/typo3/sysext/core/Classes/Database/Driver/PDOSqlsrv/Driver.php:33
/srv/bamboo/xml-data/build-dir/CORE-GTN95-FMSP0PHP7412/vendor/doctrine/dbal/lib/Doctrine/DBAL/Connection.php:362
(11 more lines...)
Collapse Failed ActionTest createAndCopyParentContentWithHotelAndOfferChildrenAndDiscardCopiedParent History
Func mssql pdo PHP74 12 < 1 sec
TYPO3\CMS\Workspaces\Tests\Functional\DataHandling\IRRE\CSV\Modify\ActionTest::createAndCopyParentContentWithHotelAndOfferChildrenAndDiscardCopiedParent
Doctrine\DBAL\Driver\PDOException: SQLSTATE[42000]: [Microsoft][ODBC Driver 17 for SQL Server][SQL Server]Cannot open database "func_ftd3d8a47" requested by the login. The login failed.

/srv/bamboo/xml-data/build-dir/CORE-GTN95-FMSP0PHP7412/vendor/doctrine/dbal/lib/Doctrine/DBAL/Driver/PDOConnection.php:31
/srv/bamboo/xml-data/build-dir/CORE-GTN95-FMSP0PHP7412/vendor/doctrine/dbal/lib/Doctrine/DBAL/Driver/PDOSqlsrv/Connection.php:21
/srv/bamboo/xml-data/build-dir/CORE-GTN95-FMSP0PHP7412/typo3/sysext/core/Classes/Database/Driver/PDOSqlsrv/Connection.php:32
/srv/bamboo/xml-data/build-dir/CORE-GTN95-FMSP0PHP7412/typo3/sysext/core/Classes/Database/Driver/PDOSqlsrv/Driver.php:33
/srv/bamboo/xml-data/build-dir/CORE-GTN95-FMSP0PHP7412/vendor/doctrine/dbal/lib/Doctrine/DBAL/Connection.php:362
(11 more lines...)
Collapse Failed ActionTest moveParentContentToDifferentPageAndChangeSorting History
Func mssql pdo PHP74 12 < 1 sec
TYPO3\CMS\Workspaces\Tests\Functional\DataHandling\IRRE\CSV\Modify\ActionTest::moveParentContentToDifferentPageAndChangeSorting
Doctrine\DBAL\Driver\PDOException: SQLSTATE[42000]: [Microsoft][ODBC Driver 17 for SQL Server][SQL Server]Cannot open database "func_ftd3d8a47" requested by the login. The login failed.

/srv/bamboo/xml-data/build-dir/CORE-GTN95-FMSP0PHP7412/vendor/doctrine/dbal/lib/Doctrine/DBAL/Driver/PDOConnection.php:31
/srv/bamboo/xml-data/build-dir/CORE-GTN95-FMSP0PHP7412/vendor/doctrine/dbal/lib/Doctrine/DBAL/Driver/PDOSqlsrv/Connection.php:21
/srv/bamboo/xml-data/build-dir/CORE-GTN95-FMSP0PHP7412/typo3/sysext/core/Classes/Database/Driver/PDOSqlsrv/Connection.php:32
/srv/bamboo/xml-data/build-dir/CORE-GTN95-FMSP0PHP7412/typo3/sysext/core/Classes/Database/Driver/PDOSqlsrv/Driver.php:33
/srv/bamboo/xml-data/build-dir/CORE-GTN95-FMSP0PHP7412/vendor/doctrine/dbal/lib/Doctrine/DBAL/Connection.php:362
(11 more lines...)
Collapse Failed ActionTest copyParentContentToDifferentPage History
Func mssql pdo PHP74 12 < 1 sec
TYPO3\CMS\Workspaces\Tests\Functional\DataHandling\IRRE\CSV\Modify\ActionTest::copyParentContentToDifferentPage
Doctrine\DBAL\Driver\PDOException: SQLSTATE[42000]: [Microsoft][ODBC Driver 17 for SQL Server][SQL Server]Cannot open database "func_ftd3d8a47" requested by the login. The login failed.

/srv/bamboo/xml-data/build-dir/CORE-GTN95-FMSP0PHP7412/vendor/doctrine/dbal/lib/Doctrine/DBAL/Driver/PDOConnection.php:31
/srv/bamboo/xml-data/build-dir/CORE-GTN95-FMSP0PHP7412/vendor/doctrine/dbal/lib/Doctrine/DBAL/Driver/PDOSqlsrv/Connection.php:21
/srv/bamboo/xml-data/build-dir/CORE-GTN95-FMSP0PHP7412/typo3/sysext/core/Classes/Database/Driver/PDOSqlsrv/Connection.php:32
/srv/bamboo/xml-data/build-dir/CORE-GTN95-FMSP0PHP7412/typo3/sysext/core/Classes/Database/Driver/PDOSqlsrv/Driver.php:33
/srv/bamboo/xml-data/build-dir/CORE-GTN95-FMSP0PHP7412/vendor/doctrine/dbal/lib/Doctrine/DBAL/Connection.php:362
(11 more lines...)
Collapse Failed ActionTest copyParentContent History
Func mssql pdo PHP74 12 < 1 sec
TYPO3\CMS\Workspaces\Tests\Functional\DataHandling\IRRE\CSV\Modify\ActionTest::copyParentContent
Doctrine\DBAL\Driver\PDOException: SQLSTATE[42000]: [Microsoft][ODBC Driver 17 for SQL Server][SQL Server]Cannot open database "func_ftd3d8a47" requested by the login. The login failed.

/srv/bamboo/xml-data/build-dir/CORE-GTN95-FMSP0PHP7412/vendor/doctrine/dbal/lib/Doctrine/DBAL/Driver/PDOConnection.php:31
/srv/bamboo/xml-data/build-dir/CORE-GTN95-FMSP0PHP7412/vendor/doctrine/dbal/lib/Doctrine/DBAL/Driver/PDOSqlsrv/Connection.php:21
/srv/bamboo/xml-data/build-dir/CORE-GTN95-FMSP0PHP7412/typo3/sysext/core/Classes/Database/Driver/PDOSqlsrv/Connection.php:32
/srv/bamboo/xml-data/build-dir/CORE-GTN95-FMSP0PHP7412/typo3/sysext/core/Classes/Database/Driver/PDOSqlsrv/Driver.php:33
/srv/bamboo/xml-data/build-dir/CORE-GTN95-FMSP0PHP7412/vendor/doctrine/dbal/lib/Doctrine/DBAL/Connection.php:362
(11 more lines...)
Collapse Failed ActionTest modifyParentWithHotelChildAndDiscardModifiedParent History
Func mssql pdo PHP74 12 < 1 sec
TYPO3\CMS\Workspaces\Tests\Functional\DataHandling\IRRE\CSV\Modify\ActionTest::modifyParentWithHotelChildAndDiscardModifiedParent
Doctrine\DBAL\Driver\PDOException: SQLSTATE[42000]: [Microsoft][ODBC Driver 17 for SQL Server][SQL Server]Cannot open database "func_ftd3d8a47" requested by the login. The login failed.

/srv/bamboo/xml-data/build-dir/CORE-GTN95-FMSP0PHP7412/vendor/doctrine/dbal/lib/Doctrine/DBAL/Driver/PDOConnection.php:31
/srv/bamboo/xml-data/build-dir/CORE-GTN95-FMSP0PHP7412/vendor/doctrine/dbal/lib/Doctrine/DBAL/Driver/PDOSqlsrv/Connection.php:21
/srv/bamboo/xml-data/build-dir/CORE-GTN95-FMSP0PHP7412/typo3/sysext/core/Classes/Database/Driver/PDOSqlsrv/Connection.php:32
/srv/bamboo/xml-data/build-dir/CORE-GTN95-FMSP0PHP7412/typo3/sysext/core/Classes/Database/Driver/PDOSqlsrv/Driver.php:33
/srv/bamboo/xml-data/build-dir/CORE-GTN95-FMSP0PHP7412/vendor/doctrine/dbal/lib/Doctrine/DBAL/Connection.php:362
(11 more lines...)
Collapse Failed ActionTest createAndLocalizeParentContentWithHotelAndOfferChildrenAndDiscardCreatedParent History
Func mssql pdo PHP74 12 < 1 sec
TYPO3\CMS\Workspaces\Tests\Functional\DataHandling\IRRE\CSV\Modify\ActionTest::createAndLocalizeParentContentWithHotelAndOfferChildrenAndDiscardCreatedParent
Doctrine\DBAL\Driver\PDOException: SQLSTATE[42000]: [Microsoft][ODBC Driver 17 for SQL Server][SQL Server]Cannot open database "func_ftd3d8a47" requested by the login. The login failed.

/srv/bamboo/xml-data/build-dir/CORE-GTN95-FMSP0PHP7412/vendor/doctrine/dbal/lib/Doctrine/DBAL/Driver/PDOConnection.php:31
/srv/bamboo/xml-data/build-dir/CORE-GTN95-FMSP0PHP7412/vendor/doctrine/dbal/lib/Doctrine/DBAL/Driver/PDOSqlsrv/Connection.php:21
/srv/bamboo/xml-data/build-dir/CORE-GTN95-FMSP0PHP7412/typo3/sysext/core/Classes/Database/Driver/PDOSqlsrv/Connection.php:32
/srv/bamboo/xml-data/build-dir/CORE-GTN95-FMSP0PHP7412/typo3/sysext/core/Classes/Database/Driver/PDOSqlsrv/Driver.php:33
/srv/bamboo/xml-data/build-dir/CORE-GTN95-FMSP0PHP7412/vendor/doctrine/dbal/lib/Doctrine/DBAL/Connection.php:362
(11 more lines...)
Collapse Failed ActionTest copyPageWithHotelBeforeParentContent History
Func mssql pdo PHP74 12 < 1 sec
TYPO3\CMS\Workspaces\Tests\Functional\DataHandling\IRRE\CSV\Modify\ActionTest::copyPageWithHotelBeforeParentContent
Doctrine\DBAL\Driver\PDOException: SQLSTATE[42000]: [Microsoft][ODBC Driver 17 for SQL Server][SQL Server]Cannot open database "func_ftd3d8a47" requested by the login. The login failed.

/srv/bamboo/xml-data/build-dir/CORE-GTN95-FMSP0PHP7412/vendor/doctrine/dbal/lib/Doctrine/DBAL/Driver/PDOConnection.php:31
/srv/bamboo/xml-data/build-dir/CORE-GTN95-FMSP0PHP7412/vendor/doctrine/dbal/lib/Doctrine/DBAL/Driver/PDOSqlsrv/Connection.php:21
/srv/bamboo/xml-data/build-dir/CORE-GTN95-FMSP0PHP7412/typo3/sysext/core/Classes/Database/Driver/PDOSqlsrv/Connection.php:32
/srv/bamboo/xml-data/build-dir/CORE-GTN95-FMSP0PHP7412/typo3/sysext/core/Classes/Database/Driver/PDOSqlsrv/Driver.php:33
/srv/bamboo/xml-data/build-dir/CORE-GTN95-FMSP0PHP7412/vendor/doctrine/dbal/lib/Doctrine/DBAL/Connection.php:362
(11 more lines...)
Collapse Failed ActionTest createParentContentWithHotelAndOfferChildren History
Func mssql pdo PHP74 12 < 1 sec
TYPO3\CMS\Workspaces\Tests\Functional\DataHandling\IRRE\CSV\Modify\ActionTest::createParentContentWithHotelAndOfferChildren
Doctrine\DBAL\Driver\PDOException: SQLSTATE[42000]: [Microsoft][ODBC Driver 17 for SQL Server][SQL Server]Cannot open database "func_ftd3d8a47" requested by the login. The login failed.

/srv/bamboo/xml-data/build-dir/CORE-GTN95-FMSP0PHP7412/vendor/doctrine/dbal/lib/Doctrine/DBAL/Driver/PDOConnection.php:31
/srv/bamboo/xml-data/build-dir/CORE-GTN95-FMSP0PHP7412/vendor/doctrine/dbal/lib/Doctrine/DBAL/Driver/PDOSqlsrv/Connection.php:21
/srv/bamboo/xml-data/build-dir/CORE-GTN95-FMSP0PHP7412/typo3/sysext/core/Classes/Database/Driver/PDOSqlsrv/Connection.php:32
/srv/bamboo/xml-data/build-dir/CORE-GTN95-FMSP0PHP7412/typo3/sysext/core/Classes/Database/Driver/PDOSqlsrv/Driver.php:33
/srv/bamboo/xml-data/build-dir/CORE-GTN95-FMSP0PHP7412/vendor/doctrine/dbal/lib/Doctrine/DBAL/Connection.php:362
(11 more lines...)
Collapse Failed ActionTest modifyPage History
Func mssql pdo PHP74 12 < 1 sec
TYPO3\CMS\Workspaces\Tests\Functional\DataHandling\IRRE\CSV\Modify\ActionTest::modifyPage
Doctrine\DBAL\Driver\PDOException: SQLSTATE[42000]: [Microsoft][ODBC Driver 17 for SQL Server][SQL Server]Cannot open database "func_ftd3d8a47" requested by the login. The login failed.

/srv/bamboo/xml-data/build-dir/CORE-GTN95-FMSP0PHP7412/vendor/doctrine/dbal/lib/Doctrine/DBAL/Driver/PDOConnection.php:31
/srv/bamboo/xml-data/build-dir/CORE-GTN95-FMSP0PHP7412/vendor/doctrine/dbal/lib/Doctrine/DBAL/Driver/PDOSqlsrv/Connection.php:21
/srv/bamboo/xml-data/build-dir/CORE-GTN95-FMSP0PHP7412/typo3/sysext/core/Classes/Database/Driver/PDOSqlsrv/Connection.php:32
/srv/bamboo/xml-data/build-dir/CORE-GTN95-FMSP0PHP7412/typo3/sysext/core/Classes/Database/Driver/PDOSqlsrv/Driver.php:33
/srv/bamboo/xml-data/build-dir/CORE-GTN95-FMSP0PHP7412/vendor/doctrine/dbal/lib/Doctrine/DBAL/Connection.php:362
(11 more lines...)
Collapse Failed ActionTest createAndLocalizeParentContentWithHotelAndOfferChildrenAndDiscardLocalizedParent History
Func mssql pdo PHP74 12 < 1 sec
TYPO3\CMS\Workspaces\Tests\Functional\DataHandling\IRRE\CSV\Modify\ActionTest::createAndLocalizeParentContentWithHotelAndOfferChildrenAndDiscardLocalizedParent
Doctrine\DBAL\Driver\PDOException: SQLSTATE[42000]: [Microsoft][ODBC Driver 17 for SQL Server][SQL Server]Cannot open database "func_ftd3d8a47" requested by the login. The login failed.

/srv/bamboo/xml-data/build-dir/CORE-GTN95-FMSP0PHP7412/vendor/doctrine/dbal/lib/Doctrine/DBAL/Driver/PDOConnection.php:31
/srv/bamboo/xml-data/build-dir/CORE-GTN95-FMSP0PHP7412/vendor/doctrine/dbal/lib/Doctrine/DBAL/Driver/PDOSqlsrv/Connection.php:21
/srv/bamboo/xml-data/build-dir/CORE-GTN95-FMSP0PHP7412/typo3/sysext/core/Classes/Database/Driver/PDOSqlsrv/Connection.php:32
/srv/bamboo/xml-data/build-dir/CORE-GTN95-FMSP0PHP7412/typo3/sysext/core/Classes/Database/Driver/PDOSqlsrv/Driver.php:33
/srv/bamboo/xml-data/build-dir/CORE-GTN95-FMSP0PHP7412/vendor/doctrine/dbal/lib/Doctrine/DBAL/Connection.php:362
(11 more lines...)
Collapse Failed ActionTest modifyParentContent History
Func mssql pdo PHP74 12 < 1 sec
TYPO3\CMS\Workspaces\Tests\Functional\DataHandling\IRRE\CSV\Modify\ActionTest::modifyParentContent
Doctrine\DBAL\Driver\PDOException: SQLSTATE[42000]: [Microsoft][ODBC Driver 17 for SQL Server][SQL Server]Cannot open database "func_ftd3d8a47" requested by the login. The login failed.

/srv/bamboo/xml-data/build-dir/CORE-GTN95-FMSP0PHP7412/vendor/doctrine/dbal/lib/Doctrine/DBAL/Driver/PDOConnection.php:31
/srv/bamboo/xml-data/build-dir/CORE-GTN95-FMSP0PHP7412/vendor/doctrine/dbal/lib/Doctrine/DBAL/Driver/PDOSqlsrv/Connection.php:21
/srv/bamboo/xml-data/build-dir/CORE-GTN95-FMSP0PHP7412/typo3/sysext/core/Classes/Database/Driver/PDOSqlsrv/Connection.php:32
/srv/bamboo/xml-data/build-dir/CORE-GTN95-FMSP0PHP7412/typo3/sysext/core/Classes/Database/Driver/PDOSqlsrv/Driver.php:33
/srv/bamboo/xml-data/build-dir/CORE-GTN95-FMSP0PHP7412/vendor/doctrine/dbal/lib/Doctrine/DBAL/Connection.php:362
(11 more lines...)
Collapse Failed ActionTest changeParentContentSorting History
Func mssql pdo PHP74 12 < 1 sec
TYPO3\CMS\Workspaces\Tests\Functional\DataHandling\IRRE\CSV\Modify\ActionTest::changeParentContentSorting
Doctrine\DBAL\Driver\PDOException: SQLSTATE[42000]: [Microsoft][ODBC Driver 17 for SQL Server][SQL Server]Cannot open database "func_ftd3d8a47" requested by the login. The login failed.

/srv/bamboo/xml-data/build-dir/CORE-GTN95-FMSP0PHP7412/vendor/doctrine/dbal/lib/Doctrine/DBAL/Driver/PDOConnection.php:31
/srv/bamboo/xml-data/build-dir/CORE-GTN95-FMSP0PHP7412/vendor/doctrine/dbal/lib/Doctrine/DBAL/Driver/PDOSqlsrv/Connection.php:21
/srv/bamboo/xml-data/build-dir/CORE-GTN95-FMSP0PHP7412/typo3/sysext/core/Classes/Database/Driver/PDOSqlsrv/Connection.php:32
/srv/bamboo/xml-data/build-dir/CORE-GTN95-FMSP0PHP7412/typo3/sysext/core/Classes/Database/Driver/PDOSqlsrv/Driver.php:33
/srv/bamboo/xml-data/build-dir/CORE-GTN95-FMSP0PHP7412/vendor/doctrine/dbal/lib/Doctrine/DBAL/Connection.php:362
(11 more lines...)
Fixed tests 3
Status Test Failing since View job Duration
Successful BackendGroupsVisibleFieldsTest backendGroupsFormContainsExpectedFields History
Failing since build #43 (Rebuilt by Bamboo CLI Admin) Func mssql pdo PHP73 11 14 secs
Successful TemplateVisibleFieldsTest templateFormContainsExpectedFields History
Failing since build #43 (Rebuilt by Bamboo CLI Admin) Func mssql pdo PHP73 11 12 secs
Successful GroupFileAndFileReferenceItemInFlexFormTest importGroupFileAndFileReferenceItemInFlexForm History
Failing since build #43 (Rebuilt by Bamboo CLI Admin) Func mssql pdo PHP73 11 16 secs