Execute TYPO3 core master nightly tests. Auto generated! See Build/bamboo of core git repository.

Build: #57 failed Rebuilt by Bamboo CLI Admin

Stages & jobs

  1. Preparation

  2. Integrity

  3. Unit Tests PHP72

  4. Unit Tests PHP73

  5. Unit Tests PHP74

  6. Acceptance mysql

  7. Functionals mssql PHP 7.3

  8. Acceptance sqlite

  9. Acceptance pgsql

  10. Functionals mssql PHP7.4

  11. Functionals mysql PHP 7.2

  12. Functionals mysql PHP 7.3

  13. Functionals mysql PHP 7.4

  14. Functionals pgsql

  15. Functionals sqlite

  16. Functionals mssql PHP 7.2

Build result summary

Details

Completed
Duration
5 minutes
Labels
change-patchset-
Revision
27ccbd29530318e9b7c0d1a478e3a920e85c2fb2 27ccbd29530318e9b7c0d1a478e3a920e85c2fb2
Total tests
94724
Fixed in
#58 (Scheduled with changes by 3 people)
Number of retries
1

Tests

Responsible

No one has taken responsibility for this failure

Code commits

Author Commit Message Commit date
Nikita Hovratov <nikita.h@live.de> Nikita Hovratov <nikita.h@live.de> 27ccbd29530318e9b7c0d1a478e3a920e85c2fb2 27ccbd29530318e9b7c0d1a478e3a920e85c2fb2 [BUGFIX] Set fixed widths for extension manager ui elements
The search field has now an own class to apply css before
the wrapper gets rendered. The extension list table columns
have now explicit widths. This ensures the view is not slightly
changing after initial JavaScript operations.

Resolves: #91732
Releases: master, 10.4
Change-Id: Ic9ce327cfa6b5e415974792ee33896540e5a3de6
Reviewed-on: https://review.typo3.org/c/Packages/TYPO3.CMS/+/65021
Tested-by: TYPO3com <noreply@typo3.com>
Tested-by: Daniel Goerz <daniel.goerz@posteo.de>
Reviewed-by: Daniel Goerz <daniel.goerz@posteo.de>
Alexander Stehlik <alexander.stehlik@gmail.com> Alexander Stehlik <alexander.stehlik@gmail.com> 497756ecdfe4ceeedbed119b959ec73a457f9615 497756ecdfe4ceeedbed119b959ec73a457f9615 [BUGFIX] Increase size of sitemap_priority database field
The field size is increased to decimal(2,1) to be able to store
the value 1.0 zero in MariaDB databases.

Resolves: #91736
Releases: master, 10.4
Change-Id: I72aa5e5a1f23673f6912b2f042c9d9364fd9855f
Reviewed-on: https://review.typo3.org/c/Packages/TYPO3.CMS/+/65020
Tested-by: TYPO3com <noreply@typo3.com>
Tested-by: Benni Mack <benni@typo3.org>
Reviewed-by: Benni Mack <benni@typo3.org>

Tests

New test failures 3
Status Test View job Duration
Collapse Failed JsonViewTest testTransformValue with data set #8 History
Unit composer max PHP72 < 1 sec
TYPO3\CMS\Extbase\Tests\Unit\Mvc\View\JsonViewTest::testTransformValue with data set #8 (class@anonymous/srv/bamboo/xml-data/build-dir/CORE-GTN104-UT1PHP72/typo3/sysext/extbase/Tests/Unit/Mvc/View/JsonViewTest.php0x7fbca1dd1283 Object (...), array(array('name', 'path', 'properties'), array(array(array('prohibited')))), array('name', 'path', array('bar')), 'descending into arrays should...ssible')
InvalidArgumentException: Expected an implementation of "phpDocumentor\Reflection\DocBlock\Tag". Got: "TYPO3\CMS\Extbase\Reflection\DocBlock\Tags\Null_"

/srv/bamboo/xml-data/build-dir/CORE-GTN104-UT1PHP72/typo3/sysext/extbase/Classes/Reflection/ClassSchema.php:164
/srv/bamboo/xml-data/build-dir/CORE-GTN104-UT1PHP72/typo3/sysext/extbase/Classes/Reflection/ReflectionService.php:123
/srv/bamboo/xml-data/build-dir/CORE-GTN104-UT1PHP72/typo3/sysext/extbase/Classes/Reflection/ReflectionService.php:110
/srv/bamboo/xml-data/build-dir/CORE-GTN104-UT1PHP72/typo3/sysext/extbase/Classes/Reflection/ObjectAccess.php:227
/srv/bamboo/xml-data/build-dir/CORE-GTN104-UT1PHP72/typo3/sysext/extbase/Classes/Mvc/View/JsonView.php:304
(4 more lines...)
Collapse Failed MethodTest classSchemaDetectsInjectMethods History
Unit composer max PHP72 random 2 < 1 sec
TYPO3\CMS\Extbase\Tests\Unit\Reflection\ClassSchema\MethodTest::classSchemaDetectsInjectMethods
InvalidArgumentException: Expected an implementation of "phpDocumentor\Reflection\DocBlock\Tag". Got: "TYPO3\CMS\Extbase\Reflection\DocBlock\Tags\Null_"

/srv/bamboo/xml-data/build-dir/CORE-GTN104-UTR1PHP722/typo3/sysext/extbase/Classes/Reflection/ClassSchema.php:164
/srv/bamboo/xml-data/build-dir/CORE-GTN104-UTR1PHP722/typo3/sysext/extbase/Tests/Unit/Reflection/ClassSchema/MethodTest.php:57
/srv/bamboo/xml-data/build-dir/CORE-GTN104-UTR1PHP722/vendor/phpunit/phpunit/phpunit:61
Collapse Failed ObjectAccessTest getGettablePropertyNamesRespectsMethodArguments History
Unit composer max PHP72 random 1 < 1 sec
TYPO3\CMS\Extbase\Tests\Unit\Reflection\ObjectAccessTest::getGettablePropertyNamesRespectsMethodArguments
InvalidArgumentException: Expected an implementation of "phpDocumentor\Reflection\DocBlock\Tag". Got: "TYPO3\CMS\Extbase\Reflection\DocBlock\Tags\Null_"

/srv/bamboo/xml-data/build-dir/CORE-GTN104-UTR1PHP721/typo3/sysext/extbase/Classes/Reflection/ClassSchema.php:164
/srv/bamboo/xml-data/build-dir/CORE-GTN104-UTR1PHP721/typo3/sysext/extbase/Classes/Reflection/ReflectionService.php:123
/srv/bamboo/xml-data/build-dir/CORE-GTN104-UTR1PHP721/typo3/sysext/extbase/Classes/Reflection/ReflectionService.php:110
/srv/bamboo/xml-data/build-dir/CORE-GTN104-UTR1PHP721/typo3/sysext/extbase/Classes/Reflection/ObjectAccess.php:227
/srv/bamboo/xml-data/build-dir/CORE-GTN104-UTR1PHP721/typo3/sysext/extbase/Tests/Unit/Reflection/ObjectAccessTest.php:319
(1 more lines...)