Execute TYPO3 core 8.7 pre-merge tests. Auto generated! See Build/bamboo of core git repository.

Build: #6 failed Manual run by Bamboo CLI Admin

Build result summary

Details

Completed
Duration
17 minutes
Flags
Custom build
Labels
patchset-2change-63215
Revision
c6f5cb5740ebb9bdfa6e14e23dbe35406ff02506 c6f5cb5740ebb9bdfa6e14e23dbe35406ff02506
Total tests
102478
Failing since
#5 (Manual run by Bamboo CLI Admin)
Fixed in
#7 (Manual run by Bamboo CLI Admin)

Tests

Responsible

This build has been failing since #5
No one has taken responsibility

Custom variables

Name Value
patchset 2
changeUrl 63215

Tests

New test failures 3
Status Test View job Duration
Collapse Failed Install (mysql) installTypo3OnMysql History
Accept inst my PHP73 12 secs
BlankPageCest: Install typo3 on mysql
Facebook\WebDriver\Exception\TimeOutException: Waited for 10 secs but text 'Database connection' still not found

/srv/bamboo/xml-data/build-dir/CORE-GTC87-ACINSTMYPHP73/vendor/facebook/webdriver/lib/WebDriverWait.php:84
/srv/bamboo/xml-data/build-dir/CORE-GTC87-ACINSTMYPHP73/typo3/sysext/core/Tests/Acceptance/Support/_generated/InstallTesterActions.php:2458
/srv/bamboo/xml-data/build-dir/CORE-GTC87-ACINSTMYPHP73/typo3/sysext/core/Tests/Acceptance/Install/Mysql/BlankPageCest.php:42
Collapse Failed Install (mysql) installTypo3OnMysql History
Accept inst my PHP74 12 secs
BlankPageCest: Install typo3 on mysql
Facebook\WebDriver\Exception\TimeOutException: Waited for 10 secs but text 'Database connection' still not found

/srv/bamboo/xml-data/build-dir/CORE-GTC87-ACINSTMYPHP74/vendor/facebook/webdriver/lib/WebDriverWait.php:84
/srv/bamboo/xml-data/build-dir/CORE-GTC87-ACINSTMYPHP74/typo3/sysext/core/Tests/Acceptance/Support/_generated/InstallTesterActions.php:2458
/srv/bamboo/xml-data/build-dir/CORE-GTC87-ACINSTMYPHP74/typo3/sysext/core/Tests/Acceptance/Install/Mysql/BlankPageCest.php:42
Collapse Failed Install (postgresql) installTypo3OnPgSql History
Accept inst pg PHP72 12 secs
BlankPageCest: Install typo3 on pg sql
Facebook\WebDriver\Exception\TimeOutException: Waited for 10 secs but text 'Database connection' still not found

/srv/bamboo/xml-data/build-dir/CORE-GTC87-ACINSTPGPHP72/vendor/facebook/webdriver/lib/WebDriverWait.php:84
/srv/bamboo/xml-data/build-dir/CORE-GTC87-ACINSTPGPHP72/typo3/sysext/core/Tests/Acceptance/Support/_generated/InstallTesterActions.php:2458
/srv/bamboo/xml-data/build-dir/CORE-GTC87-ACINSTPGPHP72/typo3/sysext/core/Tests/Acceptance/Install/Postgresql/BlankPageCest.php:42

Jira issues

IssueDescriptionStatus
Unknown Issue TypeCHANGE-63215Could not obtain issue details from Jira
Unknown Issue TypePATCHSET-2Could not obtain issue details from Jira