Execute TYPO3 core master pre-merge tests. Auto generated! See Build/bamboo of core git repository.

Build: #80 failed Manual run by Bamboo CLI Admin

Build result summary

Details

Completed
Duration
12 minutes
Flags
Custom build
Labels
patchset-3change-62618
Revision
33ef6972c36b590d880ff77acc99161cb2450629 33ef6972c36b590d880ff77acc99161cb2450629
Total tests
71694
Fixed in
#81 (Changes by 3 people)

Tests

Responsible

No one has taken responsibility for this failure

Custom variables

Name Value
patchset 3
changeUrl 62618

Tests

New test failures 16
Status Test View job Duration
Collapse Failed Backend checkIfTypo3LogoIsLinked History
Accept my PHP73 05 4 secs
LogoCest: Check if typo3 logo is linked
Failed asserting that an array is not empty.

/srv/bamboo/xml-data/build-dir/CORE-GTC-ACMY0PHP7305/typo3/sysext/core/Tests/Acceptance/Support/_generated/BackendTesterActions.php:1678
/srv/bamboo/xml-data/build-dir/CORE-GTC-ACMY0PHP7305/typo3/sysext/core/Tests/Acceptance/Backend/Topbar/LogoCest.php:38
Collapse Failed Backend loginWorksAsAdminUser History
Accept my PHP73 02 35 secs
BackendLoginCest: Login with admin
Facebook\WebDriver\Exception\NoSuchElementException: no such element: Unable to locate element: {"method":"css selector","selector":".nav"}
  (Session info: chrome=67.0.3396.87)
  (Driver info: chromedriver=2.40.565383 (76257d1ab79276b2d53ee976b2c3e3b9f335cde7),platform=Linux 4.15.0-76-generic x86_64)

/srv/bamboo/xml-data/build-dir/CORE-GTC-ACMY0PHP7302/vendor/facebook/webdriver/lib/Exception/WebDriverException.php:102
/srv/bamboo/xml-data/build-dir/CORE-GTC-ACMY0PHP7302/vendor/facebook/webdriver/lib/Remote/HttpCommandExecutor.php:326
/srv/bamboo/xml-data/build-dir/CORE-GTC-ACMY0PHP7302/vendor/facebook/webdriver/lib/Remote/RemoteWebDriver.php:547
(6 more lines...)
Collapse Failed Backend loginWorksAsEditorUser History
Accept my PHP73 02 34 secs
BackendLoginCest: Login works as editor user
Facebook\WebDriver\Exception\NoSuchElementException: no such element: Unable to locate element: {"method":"css selector","selector":".nav"}
  (Session info: chrome=67.0.3396.87)
  (Driver info: chromedriver=2.40.565383 (76257d1ab79276b2d53ee976b2c3e3b9f335cde7),platform=Linux 4.15.0-76-generic x86_64)

/srv/bamboo/xml-data/build-dir/CORE-GTC-ACMY0PHP7302/vendor/facebook/webdriver/lib/Exception/WebDriverException.php:102
/srv/bamboo/xml-data/build-dir/CORE-GTC-ACMY0PHP7302/vendor/facebook/webdriver/lib/Remote/HttpCommandExecutor.php:326
/srv/bamboo/xml-data/build-dir/CORE-GTC-ACMY0PHP7302/vendor/facebook/webdriver/lib/Remote/RemoteWebDriver.php:547
(6 more lines...)
Collapse Failed Backend selectingAModuleDoesHighlightIt History
Accept my PHP73 09 2 secs
ModuleMenuCest: Check that the second element has no "active" class\'
Number of elements counted differs from expected range
Failed asserting that false is true.

/srv/bamboo/xml-data/build-dir/CORE-GTC-ACMY0PHP7309/typo3/sysext/core/Tests/Acceptance/Support/_generated/BackendTesterActions.php:1838
/srv/bamboo/xml-data/build-dir/CORE-GTC-ACMY0PHP7309/typo3/sysext/core/Tests/Acceptance/Backend/General/ModuleMenuCest.php:61
Collapse Failed Backend checkIfModuleMenuIsCollapsible History
Accept my PHP73 09 13 secs
ModuleMenuCest: Collapse the menu element
Facebook\WebDriver\Exception\NoSuchElementException: no such element: Unable to locate element: {"method":"css selector","selector":"#web .modulemenu-group-header"}
  (Session info: chrome=67.0.3396.87)
  (Driver info: chromedriver=2.40.565383 (76257d1ab79276b2d53ee976b2c3e3b9f335cde7),platform=Linux 4.15.0-76-generic x86_64)

/srv/bamboo/xml-data/build-dir/CORE-GTC-ACMY0PHP7309/vendor/facebook/webdriver/lib/Exception/WebDriverException.php:102
/srv/bamboo/xml-data/build-dir/CORE-GTC-ACMY0PHP7309/vendor/facebook/webdriver/lib/Remote/HttpCommandExecutor.php:326
/srv/bamboo/xml-data/build-dir/CORE-GTC-ACMY0PHP7309/vendor/facebook/webdriver/lib/Remote/RemoteWebDriver.php:547
(5 more lines...)
Collapse Failed Backend checkTreeExpandsAndCollapseByPageModule History
Accept my PHP73 06 4 secs
NavigationComponentTreeCest: Check Page Module for Collapse
Link or Button or CSS or XPath element with 'button.t3js-topbar-button-navigationcomponent' was not found.

/srv/bamboo/xml-data/build-dir/CORE-GTC-ACMY0PHP7306/typo3/sysext/core/Tests/Acceptance/Support/_generated/BackendTesterActions.php:628
/srv/bamboo/xml-data/build-dir/CORE-GTC-ACMY0PHP7306/typo3/sysext/core/Tests/Acceptance/Backend/Topbar/NavigationComponentTreeCest.php:44
Collapse Failed Backend seeFlushCachesLinksInClearCacheModule History
Accept my PHP73 06 3 secs
FlushCest: See flush caches links in clear cache module
Link or Button or CSS or XPath element with '.dropdown-toggle' was not found.

/srv/bamboo/xml-data/build-dir/CORE-GTC-ACMY0PHP7306/typo3/sysext/core/Tests/Acceptance/Support/_generated/BackendTesterActions.php:628
/srv/bamboo/xml-data/build-dir/CORE-GTC-ACMY0PHP7306/typo3/sysext/core/Tests/Acceptance/Backend/Topbar/FlushCest.php:57
Collapse Failed Backend checkTreeExpandsAndCollapseByFileModule History
Accept my PHP73 06 5 secs
NavigationComponentTreeCest: Check File Module for Collapse
Link or Button or CSS or XPath element with 'button.t3js-topbar-button-navigationcomponent' was not found.

/srv/bamboo/xml-data/build-dir/CORE-GTC-ACMY0PHP7306/typo3/sysext/core/Tests/Acceptance/Support/_generated/BackendTesterActions.php:628
/srv/bamboo/xml-data/build-dir/CORE-GTC-ACMY0PHP7306/typo3/sysext/core/Tests/Acceptance/Backend/Topbar/NavigationComponentTreeCest.php:66
Collapse Failed Backend checkUninstallingAndInstallingAnExtension History
Accept my PHP73 02 9 secs
InstalledExtensionsCest: Check if uninstalling and installing an extension with backend module removes and adds the module from the module menu.
Found following JavaScript errors in the browser console:
15:04:10.994 SEVERE - http://web:8000/typo3temp/var/tests/acceptance/typo3/index.php?route=%2Fajax%2Ftopbar&token=da01478cd043dce1e708160624f155f0036519bd - Failed to load resource: the server responded with a status of 500 (Internal Server Error)

/srv/bamboo/xml-data/build-dir/CORE-GTC-ACMY0PHP7302/vendor/typo3/testing-framework/Classes/Core/Acceptance/Helper/Acceptance.php:80
/srv/bamboo/xml-data/build-dir/CORE-GTC-ACMY0PHP7302/vendor/typo3/testing-framework/Classes/Core/Acceptance/Helper/Acceptance.php:48
/srv/bamboo/xml-data/build-dir/CORE-GTC-ACMY0PHP7302/vendor/symfony/event-dispatcher/EventDispatcher.php:264
/srv/bamboo/xml-data/build-dir/CORE-GTC-ACMY0PHP7302/vendor/symfony/event-dispatcher/EventDispatcher.php:239
(3 more lines...)
Collapse Failed Backend checkThatBookmarkListIsInitiallyEmpty History
Accept my PHP73 07 12 secs
BookmarkCest: Check that bookmark list is initially empty
Facebook\WebDriver\Exception\NoSuchElementException: no such element: Unable to locate element: {"method":"css selector","selector":"#typo3-cms-backend-backend-toolbaritems-shortcuttoolbaritem .dropdown-toggle"}
  (Session info: chrome=67.0.3396.87)
  (Driver info: chromedriver=2.40.565383 (76257d1ab79276b2d53ee976b2c3e3b9f335cde7),platform=Linux 4.15.0-76-generic x86_64)

/srv/bamboo/xml-data/build-dir/CORE-GTC-ACMY0PHP7307/vendor/facebook/webdriver/lib/Exception/WebDriverException.php:102
/srv/bamboo/xml-data/build-dir/CORE-GTC-ACMY0PHP7307/vendor/facebook/webdriver/lib/Remote/HttpCommandExecutor.php:326
/srv/bamboo/xml-data/build-dir/CORE-GTC-ACMY0PHP7307/vendor/facebook/webdriver/lib/Remote/RemoteWebDriver.php:547
(6 more lines...)
Collapse Failed Backend checkModelMenuButtomFromSmallToBigScreen History
Accept my PHP73 05 4 secs
ModuleMenuButtonCest: See the module menu button behavior when enlarging the window
Element located either by name, CSS or XPath element with 'span.modulemenu-group-title' was not found.

/srv/bamboo/xml-data/build-dir/CORE-GTC-ACMY0PHP7305/typo3/sysext/core/Tests/Acceptance/Support/_generated/BackendTesterActions.php:344
/srv/bamboo/xml-data/build-dir/CORE-GTC-ACMY0PHP7305/typo3/sysext/core/Tests/Acceptance/Backend/Topbar/ModuleMenuButtonCest.php:75
Collapse Failed Backend seeStyleguideInHelpModule History
Accept my PHP73 10 3 secs
HelpCest: See styleguide in help module
Link or Button or CSS or XPath element with '.dropdown-toggle' was not found.

/srv/bamboo/xml-data/build-dir/CORE-GTC-ACMY0PHP7310/typo3/sysext/core/Tests/Acceptance/Support/_generated/BackendTesterActions.php:628
/srv/bamboo/xml-data/build-dir/CORE-GTC-ACMY0PHP7310/typo3/sysext/core/Tests/Acceptance/Backend/Topbar/HelpCest.php:57
Collapse Failed Backend checkModelMenuButtomFromBigToSmallScreen History
Accept my PHP73 05 4 secs
ModuleMenuButtonCest: See the module menu button behavior when shrinking the window
Element located either by name, CSS or XPath element with 'span.modulemenu-group-title' was not found.

/srv/bamboo/xml-data/build-dir/CORE-GTC-ACMY0PHP7305/typo3/sysext/core/Tests/Acceptance/Support/_generated/BackendTesterActions.php:344
/srv/bamboo/xml-data/build-dir/CORE-GTC-ACMY0PHP7305/typo3/sysext/core/Tests/Acceptance/Backend/Topbar/ModuleMenuButtonCest.php:41
Collapse Failed Install (mysql) installTypo3OnMysql History
Accept inst my PHP74 47 secs
BlankPageCest: Install typo3 on mysql
Facebook\WebDriver\Exception\NoSuchElementException: no such element: Unable to locate element: {"method":"css selector","selector":".nav"}
  (Session info: chrome=67.0.3396.87)
  (Driver info: chromedriver=2.40.565383 (76257d1ab79276b2d53ee976b2c3e3b9f335cde7),platform=Linux 4.15.0-76-generic x86_64)

/srv/bamboo/xml-data/build-dir/CORE-GTC-ACINSTMY0PHP74/vendor/facebook/webdriver/lib/Exception/WebDriverException.php:102
/srv/bamboo/xml-data/build-dir/CORE-GTC-ACINSTMY0PHP74/vendor/facebook/webdriver/lib/Remote/HttpCommandExecutor.php:326
/srv/bamboo/xml-data/build-dir/CORE-GTC-ACINSTMY0PHP74/vendor/facebook/webdriver/lib/Remote/RemoteWebDriver.php:547
(5 more lines...)
Collapse Failed Install (postgresql) installTypo3OnPgSql History
Accept inst pg PHP73 48 secs
BlankPageCest: Install typo3 on pg sql
Facebook\WebDriver\Exception\NoSuchElementException: no such element: Unable to locate element: {"method":"css selector","selector":".nav"}
  (Session info: chrome=67.0.3396.87)
  (Driver info: chromedriver=2.40.565383 (76257d1ab79276b2d53ee976b2c3e3b9f335cde7),platform=Linux 4.15.0-76-generic x86_64)

/srv/bamboo/xml-data/build-dir/CORE-GTC-ACINSTPG0PHP73/vendor/facebook/webdriver/lib/Exception/WebDriverException.php:102
/srv/bamboo/xml-data/build-dir/CORE-GTC-ACINSTPG0PHP73/vendor/facebook/webdriver/lib/Remote/HttpCommandExecutor.php:326
/srv/bamboo/xml-data/build-dir/CORE-GTC-ACINSTPG0PHP73/vendor/facebook/webdriver/lib/Remote/RemoteWebDriver.php:547
(5 more lines...)
Collapse Failed Install (sqlite) installTypo3OnSqlite History
Accept inst sq PHP72 47 secs
BlankPageCest: Install typo3 on sqlite
Facebook\WebDriver\Exception\NoSuchElementException: no such element: Unable to locate element: {"method":"css selector","selector":".nav"}
  (Session info: chrome=67.0.3396.87)
  (Driver info: chromedriver=2.40.565383 (76257d1ab79276b2d53ee976b2c3e3b9f335cde7),platform=Linux 4.15.0-76-generic x86_64)

/srv/bamboo/xml-data/build-dir/CORE-GTC-ACINSTSQ0PHP72/vendor/facebook/webdriver/lib/Exception/WebDriverException.php:102
/srv/bamboo/xml-data/build-dir/CORE-GTC-ACINSTSQ0PHP72/vendor/facebook/webdriver/lib/Remote/HttpCommandExecutor.php:326
/srv/bamboo/xml-data/build-dir/CORE-GTC-ACINSTSQ0PHP72/vendor/facebook/webdriver/lib/Remote/RemoteWebDriver.php:547
(5 more lines...)

Jira issues

IssueDescriptionStatus
Unknown Issue TypeCHANGE-62618Could not obtain issue details from Jira
Unknown Issue TypePATCHSET-3Could not obtain issue details from Jira