Execute TYPO3 core master pre-merge tests. Auto generated! See Build/bamboo of core git repository.

Build: #1770 failed Rebuilt by Susanne Moog

Build result summary

Details

Completed
Duration
12 minutes
Flags
RebuildCustom build
Labels
change-63932patchset-2
Revision
7a46aa1648c8a7575b189772ea48f005a136383c 7a46aa1648c8a7575b189772ea48f005a136383c
Total tests
73495
Failing since
#1769 (Manual run by Bamboo CLI Admin)
Fixed in
#1771 (Rebuilt by Daniel Goerz)
Number of retries
2

Tests

Responsible

This build has been failing since #1769
No one has taken responsibility

Custom variables

Name Value
patchset 2
changeUrl 63932

Tests

New test failures 3
Status Test View job Duration
Collapse Failed Install (mysql) installTypo3OnMysql History
Accept inst my PHP74 11 secs
BlankPageCest: Install typo3 on mysql
Facebook\WebDriver\Exception\TimeoutException: Waited for 10 secs but text 'No problems detected, continue with installation' still not found

/srv/bamboo/xml-data/build-dir/CORE-GTC-ACINSTMY0PHP74/vendor/php-webdriver/webdriver/lib/WebDriverWait.php:71
/srv/bamboo/xml-data/build-dir/CORE-GTC-ACINSTMY0PHP74/typo3/sysext/core/Tests/Acceptance/Support/_generated/InstallTesterActions.php:2480
/srv/bamboo/xml-data/build-dir/CORE-GTC-ACINSTMY0PHP74/typo3/sysext/core/Tests/Acceptance/Install/Mysql/BlankPageCest.php:37
Collapse Failed Install (postgresql) installTypo3OnPgSql History
Accept inst pg PHP73 11 secs
BlankPageCest: Install typo3 on pg sql
Facebook\WebDriver\Exception\TimeoutException: Waited for 10 secs but text 'No problems detected, continue with installation' still not found

/srv/bamboo/xml-data/build-dir/CORE-GTC-ACINSTPG0PHP73/vendor/php-webdriver/webdriver/lib/WebDriverWait.php:71
/srv/bamboo/xml-data/build-dir/CORE-GTC-ACINSTPG0PHP73/typo3/sysext/core/Tests/Acceptance/Support/_generated/InstallTesterActions.php:2480
/srv/bamboo/xml-data/build-dir/CORE-GTC-ACINSTPG0PHP73/typo3/sysext/core/Tests/Acceptance/Install/Postgresql/BlankPageCest.php:38
Collapse Failed Install (sqlite) installTypo3OnSqlite History
Accept inst sq PHP72 13 secs
BlankPageCest: Install typo3 on sqlite
Facebook\WebDriver\Exception\TimeoutException: Waited for 10 secs but text 'No problems detected, continue with installation' still not found

/srv/bamboo/xml-data/build-dir/CORE-GTC-ACINSTSQ0PHP72/vendor/php-webdriver/webdriver/lib/WebDriverWait.php:71
/srv/bamboo/xml-data/build-dir/CORE-GTC-ACINSTSQ0PHP72/typo3/sysext/core/Tests/Acceptance/Support/_generated/InstallTesterActions.php:2480
/srv/bamboo/xml-data/build-dir/CORE-GTC-ACINSTSQ0PHP72/typo3/sysext/core/Tests/Acceptance/Install/Sqlite/BlankPageCest.php:36
Fixed tests 13
Status Test Failing since View job Duration
Successful Backend filterUsersByAdmin History
Failing since build #1769 (Manual run by Bamboo CLI Admin) Accept my PHP73 05 11 secs
Successful Backend checkThatBookmarkListIsInitiallyEmpty History
Failing since build #1769 (Manual run by Bamboo CLI Admin) Accept my PHP73 07 3 secs
Successful Backend editPageTitle History
Failing since build #1769 (Manual run by Bamboo CLI Admin) Accept my PHP73 07 12 secs
Successful Backend simpleInputFields History
Failing since build #1769 (Manual run by Bamboo CLI Admin) Accept my PHP73 01 21 secs
Successful Backend simpleEvalInputFields History
Failing since build #1769 (Manual run by Bamboo CLI Admin) Accept my PHP73 03 20 secs
Successful Backend checkIfCanSortingInlineElement History
Failing since build #1769 (Manual run by Bamboo CLI Admin) Accept my PHP73 06 25 secs
Successful Backend canEditRecordFromListView History
Failing since build #1769 (Manual run by Bamboo CLI Admin) Accept my PHP73 08 9 secs
Successful Backend createNewRecordIfNoneExist History
Failing since build #1769 (Manual run by Bamboo CLI Admin) Accept my PHP73 08 9 secs
Successful Backend checkRetrievedExtensionsFromTerAreDisplayed History
Failing since build #1769 (Manual run by Bamboo CLI Admin) Accept my PHP73 10 7 secs
Successful Backend canDeleteTask History
Failing since build #1769 (Manual run by Bamboo CLI Admin) Accept my PHP73 04 13 secs
Successful Backend canCreateNewTaskGroupFromEditForm History
Failing since build #1769 (Manual run by Bamboo CLI Admin) Accept my PHP73 04 17 secs
Successful Backend sortElementsInGroup History
Failing since build #1769 (Manual run by Bamboo CLI Admin) Accept my PHP73 09 22 secs
Successful PageTree focusLastPageTreeItemWithEndKey History
Failing since build #1769 (Manual run by Bamboo CLI Admin) Accept PageTree my PHP73 9 secs

Jira issues

IssueDescriptionStatus
Unknown Issue TypeCHANGE-63932Could not obtain issue details from Jira
Unknown Issue TypePATCHSET-2Could not obtain issue details from Jira